Target
O43924/P16499/P18545/P35913/P51160/Q13956
Ligand
BDBM50126453
Substrate
Meas. Tech.
ChEMBL_155387 (CHEMBL760746)
IC50
620±n/a nM
Citation
 Maw, GNAllerton, CMGbekor, EMillion, WA Design, synthesis and biological activity of beta-carboline-based type-5 phosphodiesterase inhibitors. Bioorg Med Chem Lett 13:1425-8 (2003)  
Target
Name:
O43924/P16499/P18545/P35913/P51160/Q13956
Synonyms:
Phosphodiesterase 6
Type:
Mol. Mass.:
Description:
ASSAY_ID of ChEMBL is 387456
Components:
This complex has 6 components.
Component 1
Name:
Retinal rod rhodopsin-sensitive cGMP 3',5'-cyclic phosphodiesterase subunit gamma
Synonyms:
CNRG_HUMAN PDE6G | PDEG
Type:
PROTEIN
Mol. Mass.:
9648.05
Organism:
Homo sapiens (Human)
Description:
ChEMBL_105761
Residue:
87
  
Component 2
Name:
Retinal rod rhodopsin-sensitive cGMP 3',5'-cyclic phosphodiesterase subunit delta
Synonyms:
3',5'-cyclic phosphodiesterase PDE6D PDED Retinal rod rhodopsin-sensitive cGMP 3',5'-cyclic phosphodiesterase subunit delta
Type:
PROTEIN
Mol. Mass.:
17418.30
Organism:
Homo sapiens (Human)
Description:
ChEMBL_105761
Residue:
150
  
Component 3
Name:
Cone cGMP-specific 3',5'-cyclic phosphodiesterase subunit alpha'
Synonyms:
3',5'-cyclic phosphodiesterase PDE6C_HUMAN Phosphodiesterase 6C | Phosphodiesterase 6C (PDE6C)
Type:
Protein
Mol. Mass.:
99132.02
Organism:
Homo sapiens (Human)
Description:
P51160
Residue:
858
  
Component 4
Name:
Retinal cone rhodopsin-sensitive cGMP 3',5'-cyclic phosphodiesterase subunit gamma
Synonyms:
CNCG_HUMAN PDE6H
Type:
PROTEIN
Mol. Mass.:
9078.33
Organism:
Homo sapiens (Human)
Description:
ChEMBL_105761
Residue:
83
  
Component 5
Name:
Rod cGMP-specific 3',5'-cyclic phosphodiesterase subunit alpha
Synonyms:
PDE6A PDEA | Rod cGMP-specific 3',5'-cyclic phosphodiesterase alpha
Type:
PROTEIN
Mol. Mass.:
99531.10
Organism:
Homo sapiens (Human)
Description:
ChEMBL_1347866
Residue:
860
  
Component 6
Name:
Rod cGMP-specific 3',5'-cyclic phosphodiesterase subunit beta
Synonyms:
GMP-PDE beta PDE6B_HUMAN | PDEB
Type:
PROTEIN
Mol. Mass.:
98308.48
Organism:
Homo sapiens (Human)
Description:
ChEMBL_105761
Residue:
854
  
Inhibitor
Name:
BDBM50126453
Synonyms:
3-[(R)-3-((6R,12aR)-6-Benzo[1,3]dioxol-5-yl-1,4-dioxo-3,4,6,7,12,12a-hexahydro-1H-pyrazino[1',2':1,6]pyrido[3,4-b]indol-2-yl)-pyrrolidin-1-yl]-N-ethyl-propionamide | CHEMBL285737
Type:
Small organic molecule
Emp. Form.:
C30H33N5O5
Mol. Mass.:
543.6135
SMILES:
CCNC(=O)CCN1CC[C@H](C1)N1CC(=O)N2[C@H](Cc3c([nH]c4ccccc34)[C@H]2c2ccc3OCOc3c2)C1=O
: