Target
Prothrombin
Ligand
BDBM50126529
Substrate
Meas. Tech.
ChEBML_208514
Ki
2.6±n/a nM
Citation
 Boatman, PDUrban, JNguyen, MQabar, MKahn, M High-throughput synthesis and optimization of thrombin inhibitors via urazole alpha-addition and Michael addition. Bioorg Med Chem Lett 13:1445-9 (2003)  
Target
Name:
Prothrombin
Synonyms:
Activation peptide fragment 1 Coagulation factor II Prothrombin precursor Thrombin heavy chain | Thrombin light chain
Type:
Protein
Mol. Mass.:
70029.57
Organism:
Homo sapiens (Human)
Description:
P00734
Residue:
622
  
Inhibitor
Name:
BDBM50126529
Synonyms:
2-{5-[(4-Amino-cyclohexylmethyl)-carbamoyl]-1,3-dioxo-5,8-dihydro-[1,2,4]triazolo[1,2-a]pyridazin-2-yl}-3-(4-bromo-phenylsulfanyl)-propionic acid | CHEMBL33887
Type:
Small organic molecule
Emp. Form.:
C23H28BrN5O5S
Mol. Mass.:
566.468
SMILES:
N[C@H]1CC[C@H](CNC(=O)C2C=CCn3n2c(=O)n(C(CSc2ccc(Br)cc2)C(O)=O)c3=O)CC1
: