Target
Integrin alpha-V/beta-3
Ligand
BDBM50126595
Substrate
Meas. Tech.
ChEMBL_217804 (CHEMBL823260)
Ki
2.5±n/a nM
Citation
 Miller, WHManley, PJCousins, RDErhard, KFHeerding, DAKwon, CRoss, STSamanen, JMTakata, DTUzinskas, INYuan, CCHaltiwanger, RCGress, CJLark, MWHwang, SMJames, IERieman, DJWillette, RNYue, TLAzzarano, LMSalyers, KLSmith, BRWard, KWJohanson, KOHuffman, WF Phenylbutyrates as potent, orally bioavailable vitronectin receptor (integrin alphavbeta3) antagonists. Bioorg Med Chem Lett 13:1483-6 (2003)  
Target
Name:
Integrin alpha-V/beta-3
Synonyms:
ITGAV/ITGB3 | Integrin beta-3/Vitronectin receptor alpha
Type:
Enzyme
Mol. Mass.:
Description:
Components:
This complex has 2 components.
Component 1
Name:
Integrin alpha-V
Synonyms:
ITAV_HUMAN Integrin alpha-V/alpha-5 VNRA Vitronectin receptor | Vitronectin receptor subunit alpha
Type:
PROTEIN
Mol. Mass.:
116024.92
Organism:
Homo sapiens (Human)
Description:
ChEMBL_582336
Residue:
1048
  
Component 2
Name:
Integrin beta-3
Synonyms:
CD_antigen=CD61 GPIIIa ITGB3 Platelet membrane glycoprotein IIIa
Type:
Protein
Mol. Mass.:
87038.91
Organism:
Homo sapiens (Human)
Description:
P05106
Residue:
788
  
Inhibitor
Name:
BDBM50126595
Synonyms:
3-Phenyl-4-{4-[2-(5,6,7,8-tetrahydro-[1,8]naphthyridin-2-yl)-ethoxy]-phenyl}-butyric acid | CHEMBL37751
Type:
Small organic molecule
Emp. Form.:
C26H28N2O3
Mol. Mass.:
416.5121
SMILES:
OC(=O)C[C@H](Cc1ccc(OCCc2ccc3CCCNc3n2)cc1)c1ccccc1
: