Target
Chymotrypsinogen B
Ligand
BDBM50126635
Substrate
Meas. Tech.
ChEMBL_49791 (CHEMBL663012)
Ki
>22000±n/a nM
Citation
 Tomczuk, BLu, TSoll, RMFedde, CWang, AMurphy, LCrysler, CDasgupta, MEisennagel, SSpurlino, JBone, R Oxyguanidines: application to non-peptidic phenyl-based thrombin inhibitors. Bioorg Med Chem Lett 13:1495-8 (2003)  
Target
Name:
Chymotrypsinogen B
Synonyms:
Beta-chymotrypsin CTRB1 Chymotrypsin B chain A Chymotrypsin B chain C Synonyms=CTRB
Type:
PROTEIN
Mol. Mass.:
27713.98
Organism:
Homo sapiens (Human)
Description:
ChEMBL_10909
Residue:
263
  
Inhibitor
Name:
BDBM50126635
Synonyms:
3-[3-({[(Z)-amino(imino)methyl]amino}oxy)ethoxy]-5-methylphenyl 2-methylsulfonylbenzenesulfonate CHEMBL37637
Type:
Small organic molecule
Emp. Form.:
C18H23N3O7S2
Mol. Mass.:
457.521
SMILES:
Cc1cc(OCCCONC(N)=N)cc(OS(=O)(=O)c2ccccc2S(C)(=O)=O)c1
: