Target
RNA-directed RNA polymerase
Ligand
BDBM50126659
Substrate
Meas. Tech.
ChEMBL_163994 (CHEMBL766521)
IC50
8600±n/a nM
Citation
 Chan, LReddy, TJProulx, MDas, SKPereira, OWang, WSiddiqui, AYannopoulos, CGPoisson, CTurcotte, NDrouin, AAlaoui-Ismaili, MHBethell, RHamel, ML'Heureux, LBilimoria, DNguyen-Ba, N Identification of N,N-disubstituted phenylalanines as a novel class of inhibitors of hepatitis C NS5B polymerase. J Med Chem 46:1283-5 (2003)  
Target
Name:
RNA-directed RNA polymerase
Synonyms:
Hepatitis C virus NS5B RNA-dependent RNA polymerase | NS5B protein
Type:
Protein
Mol. Mass.:
25173.95
Organism:
Hepatitis C virus
Description:
Q8JXU8
Residue:
229
  
Inhibitor
Name:
BDBM50126659
Synonyms:
2-[(3-Bromo-benzyl)-(2,4-dichloro-benzoyl)-amino]-3-phenyl-propionic acid | CHEMBL278580
Type:
Small organic molecule
Emp. Form.:
C23H18BrCl2NO3
Mol. Mass.:
507.204
SMILES:
OC(=O)[C@@H](Cc1ccccc1)N(Cc1cccc(Br)c1)C(=O)c1ccc(Cl)cc1Cl
: