Target
Sorbitol dehydrogenase
Ligand
BDBM7460
Substrate
Meas. Tech.
ChEMBL_201011 (CHEMBL803972)
IC50
35600±n/a nM
Citation
 Da Settimo, FPrimofiore, GDa Settimo, ALa Motta, CSimorini, FNovellino, EGreco, GLavecchia, ABoldrini, E Novel, highly potent aldose reductase inhibitors: cyano(2-oxo-2,3-dihydroindol-3-yl)acetic acid derivatives. J Med Chem 46:1419-28 (2003)  
Target
Name:
Sorbitol dehydrogenase
Synonyms:
DHSO_HUMAN SORD
Type:
PROTEIN
Mol. Mass.:
38332.20
Organism:
Homo sapiens (Human)
Description:
ChEMBL_223910
Residue:
357
  
Inhibitor
Name:
BDBM7460
Synonyms:
2-(3,4-dihydroxyphenyl)-3,5,7-trihydroxy-4H-chromen-4-one 2-(3,4-dihydroxyphenyl)-3,5,7-trihydroxy-chromone;hydrate Quercetin Quercetin (21) US11021454, Compound Quercetin med.21724, Compound 4
Type:
Small organic molecule
Emp. Form.:
C15H10O7
Mol. Mass.:
302.2357
SMILES:
Oc1cc(O)c2c(c1)oc(-c1ccc(O)c(O)c1)c(O)c2=O
: