Target
Sodium-dependent serotonin transporter
Ligand
BDBM50126822
Substrate
Meas. Tech.
ChEMBL_202131 (CHEMBL808120)
Ki
601±n/a nM
Citation
 Greiner, EPrisinzano, TJohnson II, EMDersch, CMMarcus, JPartilla, JSRothman, RBJacobson, AERice, KC Structure-activity relationship studies of highly selective inhibitors of the dopamine transporter: N-benzylpiperidine analogues of 1-[2-[bis(4-fluorophenyl)methoxy]ethyl]-4-(3-phenylpropyl)piperazine. J Med Chem 46:1465-9 (2003)  
Target
Name:
Sodium-dependent serotonin transporter
Synonyms:
5-HT Transporter 5HT transporter Anandamid membrane transporter, AMT Monoamine transporters; Norepinephrine & serotonin Slc6a4 Sodium-dependent serotonin transporter (SERT) | imipramine receptor
Type:
Multi-pass membrane protein
Mol. Mass.:
70168.43
Organism:
Rattus norvegicus (rat)
Description:
P31652
Residue:
630
  
Inhibitor
Name:
BDBM50126822
Synonyms:
1-(4-fluorobenzyl)-4-(2-(bis(4-fluorophenyl)methoxy)ethyl)piperidine CHEMBL36419
Type:
Small organic molecule
Emp. Form.:
C27H28F3NO
Mol. Mass.:
439.5125
SMILES:
Fc1ccc(CN2CCC(CCOC(c3ccc(F)cc3)c3ccc(F)cc3)CC2)cc1
: