Target
Sodium-dependent dopamine transporter
Ligand
BDBM50126814
Substrate
Meas. Tech.
ChEMBL_62334 (CHEMBL674427)
Ki
1.1±n/a nM
Citation
 Greiner, EPrisinzano, TJohnson II, EMDersch, CMMarcus, JPartilla, JSRothman, RBJacobson, AERice, KC Structure-activity relationship studies of highly selective inhibitors of the dopamine transporter: N-benzylpiperidine analogues of 1-[2-[bis(4-fluorophenyl)methoxy]ethyl]-4-(3-phenylpropyl)piperazine. J Med Chem 46:1465-9 (2003)  
Target
Name:
Sodium-dependent dopamine transporter
Synonyms:
DA transporter SC6A3_RAT Sodium-dependent dopamine transporter | Sodium-dependent dopamine transporter (DAT)
Type:
Multi-pass membrane protein
Mol. Mass.:
68749.45
Organism:
Rattus norvegicus (rat)
Description:
P23977
Residue:
619
  
Inhibitor
Name:
BDBM50126814
Synonyms:
1-(4-(trifluoromethyl)benzyl)-4-(2-(bis(4-fluorophenyl)methoxy)ethyl)piperidine CHEMBL35122
Type:
Small organic molecule
Emp. Form.:
C28H28F5NO
Mol. Mass.:
489.52
SMILES:
Fc1ccc(cc1)C(OCCC1CCN(Cc2ccc(cc2)C(F)(F)F)CC1)c1ccc(F)cc1
: