Target
Dihydrofolate reductase
Ligand
BDBM50108176
Substrate
Meas. Tech.
ChEMBL_55102 (CHEMBL665362)
IC50
4.8±n/a nM
Citation
 Rosowsky, AForsch, RAQueener, SF Further studies on 2,4-diamino-5-(2',5'-disubstituted benzyl)pyrimidines as potent and selective inhibitors of dihydrofolate reductases from three major opportunistic pathogens of AIDS. J Med Chem 46:1726-36 (2003)  
Target
Name:
Dihydrofolate reductase
Synonyms:
Dihydrofolate reductase (DHFR) | Tetrahydrofolate dehydrogenase
Type:
Enzyme
Mol. Mass.:
19884.75
Organism:
Mycobacterium avium
Description:
Recombinant Mycobacterium avium DHFR expressed in E. coli.
Residue:
181
  
Inhibitor
Name:
BDBM50108176
Synonyms:
4-[3-(2,4-Diamino-pyrimidin-5-ylmethyl)-4-methoxy-phenoxy]-butyric acid | CHEMBL37696
Type:
Small organic molecule
Emp. Form.:
C16H20N4O4
Mol. Mass.:
332.3544
SMILES:
COc1ccc(OCCCC(O)=O)cc1Cc1cnc(N)nc1N
: