Target
Coagulation factor VII
Ligand
BDBM50127214
Substrate
Meas. Tech.
ChEMBL_48461 (CHEMBL663024)
IC50
2.4±n/a nM
Citation
 Zobel, KKoehler, MFBeresini, MHCaris, LDCombs, D Phosphate ester serum albumin affinity tags greatly improve peptide half-life in vivo. Bioorg Med Chem Lett 13:1513-5 (2003)  
Target
Name:
Coagulation factor VII
Synonyms:
Eptacog alfa FA7_HUMAN Factor VIIa (fVIIa) SPCA serum prothrombin conversion accelerator
Type:
Enzyme
Mol. Mass.:
51599.89
Organism:
Homo sapiens (Human)
Description:
Residue:
466
  
Inhibitor
Name:
BDBM50127214
Synonyms:
ALCDNPRIDRWYCQFVEG peptide analogue | CHEMBL2372334
Type:
Small organic molecule
Emp. Form.:
C113H165N28O32PS2
Mol. Mass.:
2522.791
SMILES:
[H][C@@]12CCCN1C(=O)[C@H](CC(N)=O)NC(=O)[C@H](CC(O)=O)NC(=O)[C@H](CSSC[C@H](NC(=O)[C@H](Cc1ccc(O)cc1)NC(=O)[C@H](Cc1c[nH]c3ccccc13)NC(=O)[C@H](CCCN=C(N)N)NC(=O)[C@H](CC(O)=O)NC(=O)[C@@]([H])(NC(=O)[C@H](CCCN=C(N)N)NC2=O)[C@@H](C)CC)C(=O)N[C@@H](CCC(N)=O)C(=O)N[C@@H](Cc1ccccc1)C(=O)N[C@@H](C(C)C)C(=O)N[C@@H](CCC(O)=O)C(=O)NCC(N)=O)NC(=O)[C@H](CC(C)C)NC(=O)[C@H](C)NC(=O)CCCCCOP(O)(=O)OCCCCCc1ccccc1
: