Target
Coagulation factor VII
Ligand
BDBM50119057
Substrate
Meas. Tech.
ChEMBL_48461 (CHEMBL663024)
IC50
2.5±n/a nM
Citation
 Zobel, KKoehler, MFBeresini, MHCaris, LDCombs, D Phosphate ester serum albumin affinity tags greatly improve peptide half-life in vivo. Bioorg Med Chem Lett 13:1513-5 (2003)  
Target
Name:
Coagulation factor VII
Synonyms:
Eptacog alfa FA7_HUMAN Factor VIIa (fVIIa) SPCA serum prothrombin conversion accelerator
Type:
Enzyme
Mol. Mass.:
51599.89
Organism:
Homo sapiens (Human)
Description:
Residue:
466
  
Inhibitor
Name:
BDBM50119057
Synonyms:
ALCDNPRIDRWYCQFVEG peptide analogue CHEMBL438599
Type:
Small organic molecule
Emp. Form.:
C110H151N29O31S3
Mol. Mass.:
2471.747
SMILES:
CC[C@H](C)[C@H]1NC(=O)[C@H](CCCNC(N)=N)NC(=O)[C@H]2CCCN2C(=O)[C@H](CC(N)=O)NC(=O)[C@@H](CC(O)=O)NC(=O)[C@@H](CSSC[C@@H](NC(=O)[C@@H](Cc2ccc(O)cc2)NC(=O)[C@H](Cc2c[nH]c3ccccc23)NC(=O)[C@@H](CCCNC(N)=N)NC(=O)[C@H](CC(O)=O)NC1=O)C(=O)N[C@@H](CCC(N)=O)C(=O)N[C@@H](Cc1ccccc1)C(=O)N[C@@H](C(C)C)C(=O)N[C@@H](CCC(O)=O)C(=O)NCC(N)=O)NC(=O)[C@H](CC(C)C)NC(=O)[C@H](C)NC(=O)CCC(=O)NS(=O)(=O)c1ccc2ccccc2c1
: