Target
Mu-type opioid receptor
Ligand
BDBM50127359
Substrate
Meas. Tech.
ChEBML_149319
Ki
34±n/a nM
Citation
 Pagé, DNguyen, NBernard, SCoupal, MGosselin, MLepage, JAdam, LBrown, W New scaffolds in the development of mu opioid-receptor ligands. Bioorg Med Chem Lett 13:1585-9 (2003)  
Target
Name:
Mu-type opioid receptor
Synonyms:
M-OR-1 MOR-1 MUOR1 Mu opiate receptor OPRM1 hMOP | mu-type opioid receptor isoform MOR-1
Type:
G Protein-Coupled Receptor (GPCR)
Mol. Mass.:
44789.51
Organism:
Homo sapiens (Human)
Description:
P35372
Residue:
400
  
Inhibitor
Name:
BDBM50127359
Synonyms:
(S)-3-[(3-Phenyl-ureido)-methyl]-3,4-dihydro-1H-isoquinoline-2-carbothioic acid [(R)-1-(4-cyano-benzyl)-pyrrolidin-2-ylmethyl]-amide | CHEMBL289512
Type:
Small organic molecule
Emp. Form.:
C31H34N6OS
Mol. Mass.:
538.706
SMILES:
O=C(NC[C@@H]1Cc2ccccc2CN1C(=S)NC[C@H]1CCCN1Cc1ccc(cc1)C#N)Nc1ccccc1
: