Target
Mu-type opioid receptor
Ligand
BDBM50127361
Substrate
Meas. Tech.
ChEBML_149319
Ki
>1000±n/a nM
Citation
 Pagé, DNguyen, NBernard, SCoupal, MGosselin, MLepage, JAdam, LBrown, W New scaffolds in the development of mu opioid-receptor ligands. Bioorg Med Chem Lett 13:1585-9 (2003)  
Target
Name:
Mu-type opioid receptor
Synonyms:
M-OR-1 MOR-1 MUOR1 Mu opiate receptor OPRM1 hMOP | mu-type opioid receptor isoform MOR-1
Type:
G Protein-Coupled Receptor (GPCR)
Mol. Mass.:
44789.51
Organism:
Homo sapiens (Human)
Description:
P35372
Residue:
400
  
Inhibitor
Name:
BDBM50127361
Synonyms:
(S)-3-(3-tert-Butyl-ureidomethyl)-3,4-dihydro-1H-isoquinoline-2-carbothioic acid ((R)-1-benzoyl-pyrrolidin-2-ylmethyl)-amide | CHEMBL40859
Type:
Small organic molecule
Emp. Form.:
C28H37N5O2S
Mol. Mass.:
507.691
SMILES:
CC(C)(C)NC(=O)NC[C@@H]1Cc2ccccc2CN1C(=S)NC[C@H]1CCCN1C(=O)c1ccccc1
: