Target
Kappa-type opioid receptor
Ligand
BDBM50127338
Substrate
Meas. Tech.
ChEBML_145961
Ki
481.0±n/a nM
Citation
 Pagé, DNguyen, NBernard, SCoupal, MGosselin, MLepage, JAdam, LBrown, W New scaffolds in the development of mu opioid-receptor ligands. Bioorg Med Chem Lett 13:1585-9 (2003)  
Target
Name:
Kappa-type opioid receptor
Synonyms:
K-OR-1 Kappa-opioid receptor (KOR) Kappa-type opioid receptor (KOR) OPIATE Kappa OPRK1 kappa opioid receptor (KOR)
Type:
G Protein-Coupled Receptor (GPCR)
Mol. Mass.:
42648.76
Organism:
Homo sapiens (Human)
Description:
P41145
Residue:
380
  
Inhibitor
Name:
BDBM50127338
Synonyms:
(S)-3-(3-tert-Butyl-ureidomethyl)-3,4-dihydro-1H-isoquinoline-2-carbothioic acid (tetrahydro-furan-2-ylmethyl)-amide | CHEMBL289137
Type:
Small organic molecule
Emp. Form.:
C21H32N4O2S
Mol. Mass.:
404.569
SMILES:
CC(C)(C)NC(=O)NC[C@@H]1Cc2ccccc2CN1C(=S)NCC1CCCO1
: