Target
Kappa-type opioid receptor
Ligand
BDBM50127354
Substrate
Meas. Tech.
ChEBML_145961
Ki
109±n/a nM
Citation
 Pagé, DNguyen, NBernard, SCoupal, MGosselin, MLepage, JAdam, LBrown, W New scaffolds in the development of mu opioid-receptor ligands. Bioorg Med Chem Lett 13:1585-9 (2003)  
Target
Name:
Kappa-type opioid receptor
Synonyms:
K-OR-1 Kappa-opioid receptor (KOR) Kappa-type opioid receptor (KOR) OPIATE Kappa OPRK1 kappa opioid receptor (KOR)
Type:
G Protein-Coupled Receptor (GPCR)
Mol. Mass.:
42648.76
Organism:
Homo sapiens (Human)
Description:
P41145
Residue:
380
  
Inhibitor
Name:
BDBM50127354
Synonyms:
(S)-3-[(3-Phenyl-ureido)-methyl]-3,4-dihydro-1H-isoquinoline-2-carbothioic acid [(R)-1-(2-methoxy-benzyl)-pyrrolidin-2-ylmethyl]-amide | CHEMBL40993
Type:
Small organic molecule
Emp. Form.:
C31H37N5O2S
Mol. Mass.:
543.723
SMILES:
COc1ccccc1CN1CCC[C@@H]1CNC(=S)N1Cc2ccccc2C[C@H]1CNC(=O)Nc1ccccc1
: