Target
Neuromedin-B receptor
Ligand
BDBM50127522
Substrate
Meas. Tech.
ChEMBL_141797 (CHEMBL748695)
EC50
15000±n/a nM
Citation
 Weber, DBerger, CEickelmann, PAntel, JKessler, H Design of selective peptidomimetic agonists for the human orphan receptor BRS-3. J Med Chem 46:1918-30 (2003)  
Target
Name:
Neuromedin-B receptor
Synonyms:
Bombesin 1 NMBR Neuromedin B Neuromedin-B receptor | Neuromedin-B-preferring bombesin receptor
Type:
Enzyme Catalytic Domain
Mol. Mass.:
43447.11
Organism:
Homo sapiens (Human)
Description:
Bombesin 1 NMBR 0::P28336
Residue:
390
  
Inhibitor
Name:
BDBM50127522
Synonyms:
2-Phenylacetylamino-pentanedioic acid 5-amide 1-{[2-(1H-indol-3-yl)-1-phenethylcarbamoyl-ethyl]-amide} | CHEMBL417947
Type:
Small organic molecule
Emp. Form.:
C32H35N5O4
Mol. Mass.:
553.6514
SMILES:
NC(=O)CCC(NC(=O)Cc1ccccc1)C(=O)NC(Cc1c[nH]c2ccccc12)C(=O)NCCc1ccccc1
: