Target
Prostaglandin G/H synthase 1
Ligand
BDBM11639
Substrate
Meas. Tech.
ChEBML_158746
IC50
10700±n/a nM
Citation
 Pal, MRao Veeramaneni, VNagabelli, MRao Kalleda, SMisra, PRao Casturi, SRao Yeleswarapu, K Conformationally restricted 3,4-diarylfuranones (2,3a,4,5-tetrahydronaphthofuranones) as selective cyclooxygenase-2 inhibitors. Bioorg Med Chem Lett 13:1639-43 (2003)  
Target
Name:
Prostaglandin G/H synthase 1
Synonyms:
COX-1 Cyclooxygenase Cyclooxygenase-1 (COX-1) PTGS1 | Prostaglandin G/H synthase (cyclooxygenase)
Type:
Enzyme
Mol. Mass.:
68692.62
Organism:
Homo sapiens (Human)
Description:
P23219
Residue:
599
  
Inhibitor
Name:
BDBM11639
Synonyms:
4-[5-(4-methylphenyl)-3-(trifluoromethyl)-1H-pyrazol-1-yl]benzene-1-sulfonamide CLX Celecoxib US11478464, Compound Celecoxib US8741944, Comparative Compound cid_2662
Type:
Small organic molecule
Emp. Form.:
C17H14F3N3O2S
Mol. Mass.:
381.372
SMILES:
Cc1ccc(cc1)-c1cc(nn1-c1ccc(cc1)S(N)(=O)=O)C(F)(F)F
: