Target
Prostaglandin G/H synthase 2
Ligand
BDBM50127650
Substrate
Meas. Tech.
ChEBML_159759
IC50
670.0±n/a nM
Citation
 Pal, MRao Veeramaneni, VNagabelli, MRao Kalleda, SMisra, PRao Casturi, SRao Yeleswarapu, K Conformationally restricted 3,4-diarylfuranones (2,3a,4,5-tetrahydronaphthofuranones) as selective cyclooxygenase-2 inhibitors. Bioorg Med Chem Lett 13:1639-43 (2003)  
Target
Name:
Prostaglandin G/H synthase 2
Synonyms:
COX2 Cyclooxygenase 2 (COX-2) Cyclooxygenase-2 (COX-2 AA) Cyclooxygenase-2 (COX-2) PGH2_HUMAN PHS II Prostaglandin E synthase/G/H synthase 2 Prostaglandin-endoperoxide synthase 2
Type:
Enzyme
Mol. Mass.:
69003.89
Organism:
Homo sapiens (Human)
Description:
Recombinant Cox-2 provided by Cayman (Cayman Chemical Co.,Ann Arbor, MI).
Residue:
604
  
Inhibitor
Name:
BDBM50127650
Synonyms:
3a-Hydroxy-8-methyl-1-(4-methylsulfanyl-phenyl)-4,5-dihydro-3aH-naphtho[2,1-b]furan-2-one | CHEMBL288423
Type:
Small organic molecule
Emp. Form.:
C20H18O3S
Mol. Mass.:
338.42
SMILES:
CSc1ccc(cc1)C1=C2c3cc(C)ccc3CCC2(O)OC1=O
: