Target
Plasminogen activator inhibitor 1
Ligand
BDBM50127727
Substrate
Meas. Tech.
ChEBML_155613
IC50
480±n/a nM
Citation
 De Nanteuil, GLila-Ambroise, CRupin, AVallez, MOVerbeuren, TJ New fibrinolytic agents: benzothiophene derivatives as inhibitors of the t-PA-PAI-1 complex formation. Bioorg Med Chem Lett 13:1705-8 (2003)  
Target
Name:
Plasminogen activator inhibitor 1
Synonyms:
Endothelial plasminogen activator inhibitor PAI-1 PAI1_HUMAN Plasminogen activator inhibitor 1 Plasminogen activator inhibitor-1 SERPINE1
Type:
Enzyme
Mol. Mass.:
45064.00
Organism:
Homo sapiens (Human)
Description:
P05121
Residue:
402
  
Inhibitor
Name:
BDBM50127727
Synonyms:
(E)-3-[5,6-Bis-(biphenyl-4-ylmethoxy)-3-(4-chloro-3-methyl-phenoxy)-benzo[b]thiophen-2-yl]-2-pyridin-4-yl-acrylic acid | CHEMBL296520
Type:
Small organic molecule
Emp. Form.:
C49H36ClNO5S
Mol. Mass.:
786.332
SMILES:
Cc1cc(Oc2c(\C=C(\C(O)=O)c3ccncc3)sc3cc(OCc4ccc(cc4)-c4ccccc4)c(OCc4ccc(cc4)-c4ccccc4)cc23)ccc1Cl
: