Target
Muscarinic acetylcholine receptor M1
Ligand
BDBM50127815
Substrate
Meas. Tech.
ChEMBL_138949 (CHEMBL745929)
Ki
900±n/a nM
Citation
 Büttelmann, BAlanine, ABourson, AGill, RHeitz, MPMutel, VPinard, ETrube, GWyler, R 4-(3,4-dihydro-1H-isoquinolin-2yl)-pyridines and 4-(3,4-dihydro-1H-isoquinolin-2-yl)-quinolines as potent NR1/2B subtype selective NMDA receptor antagonists. Bioorg Med Chem Lett 13:1759-62 (2003)  
Target
Name:
Muscarinic acetylcholine receptor M1
Synonyms:
ACM1_RAT Chrm-1 cholinergic receptor, muscarinic 1
Type:
Enzyme Catalytic Domain
Mol. Mass.:
51390.46
Organism:
RAT
Description:
P08482
Residue:
460
  
Inhibitor
Name:
BDBM50127815
Synonyms:
4-Methyl-2-pyridin-4-yl-1,2,3,4-tetrahydro-isoquinoline | CHEMBL46779
Type:
Small organic molecule
Emp. Form.:
C15H16N2
Mol. Mass.:
224.3009
SMILES:
CC1CN(Cc2ccccc12)c1ccncc1
: