Target
Coagulation factor X
Ligand
BDBM50127895
Substrate
Meas. Tech.
ChEBML_48990
Ki
2400±n/a nM
Citation
 Lam, PYAdams, JJClark, CGCalhoun, WJLuettgen, JMKnabb, RMWexler, RR Discovery of 3-amino-4-chlorophenyl P1 as a novel and potent benzamidine mimic via solid-phase synthesis of an isoxazoline library. Bioorg Med Chem Lett 13:1795-9 (2003)  
Target
Name:
Coagulation factor X
Synonyms:
Activated coagulation factor X (FXa) Coagulation factor X precursor F10 Factor X heavy chain Factor Xa Stuart-Prower factor
Type:
Enzyme
Mol. Mass.:
54726.60
Organism:
Homo sapiens (Human)
Description:
Residue:
488
  
Inhibitor
Name:
BDBM50127895
Synonyms:
3-(4-Nitro-benzo[1,3]dioxol-5-yl)-4,5-dihydro-isoxazole-5-carboxylic acid (2'-sulfamoyl-biphenyl-4-yl)-amide | CHEMBL298906
Type:
Small organic molecule
Emp. Form.:
C23H18N4O8S
Mol. Mass.:
510.476
SMILES:
NS(=O)(=O)c1ccccc1-c1ccc(NC(=O)C2C[C+]([N-]O2)c2ccc3OCOc3c2[N+]([O-])=O)cc1
: