Target
Lanosterol synthase
Ligand
BDBM50128049
Substrate
Meas. Tech.
ChEMBL_148897 (CHEMBL754981)
IC50
640±n/a nM
Citation
 Lenhart, AReinert, DJAebi, JDDehmlow, HMorand, OHSchulz, GE Binding structures and potencies of oxidosqualene cyclase inhibitors with the homologous squalene-hopene cyclase. J Med Chem 46:2083-92 (2003)  
Target
Name:
Lanosterol synthase
Synonyms:
2,3-epoxysqualene--lanosterol cyclase LSS_HUMAN Oxidosqualene--lanosterol cyclase
Type:
PROTEIN
Mol. Mass.:
83309.32
Organism:
Homo sapiens (Human)
Description:
ChEMBL_11231
Residue:
732
  
Inhibitor
Name:
BDBM50128049
Synonyms:
CHEMBL291640 | Methyl-{4-[4-(1-oxy-piperidin-1-ylmethyl)-phenyl]-cyclohexyl}-carbamic acid 4-chloro-phenyl ester
Type:
Small organic molecule
Emp. Form.:
C26H33ClN2O3
Mol. Mass.:
457.005
SMILES:
CN([C@H]1CC[C@@H](CC1)c1ccc(C[N+]2([O-])CCCCC2)cc1)C(=O)Oc1ccc(Cl)cc1
: