Target
Lanosterol synthase
Ligand
BDBM50128064
Substrate
Meas. Tech.
ChEMBL_148897 (CHEMBL754981)
IC50
13.5±n/a nM
Citation
 Lenhart, AReinert, DJAebi, JDDehmlow, HMorand, OHSchulz, GE Binding structures and potencies of oxidosqualene cyclase inhibitors with the homologous squalene-hopene cyclase. J Med Chem 46:2083-92 (2003)  
Target
Name:
Lanosterol synthase
Synonyms:
2,3-epoxysqualene--lanosterol cyclase LSS_HUMAN Oxidosqualene--lanosterol cyclase
Type:
PROTEIN
Mol. Mass.:
83309.32
Organism:
Homo sapiens (Human)
Description:
ChEMBL_11231
Residue:
732
  
Inhibitor
Name:
BDBM50128064
Synonyms:
(E)-N-allyl-4-(3-(4-bromophenyl)benzo[b]thiophen-6-yloxy)-N-methylbut-2-en-1-aminium CHEMBL65296 | N-allyl-4-(3-(4-bromophenyl)benzo[b]thiophen-6-yloxy)-N-methylbut-2-en-1-aminium
Type:
Small organic molecule
Emp. Form.:
C22H22BrNOS
Mol. Mass.:
428.385
SMILES:
CN(CC=C)C\C=C\COc1ccc2c(csc2c1)-c1ccc(Br)cc1
: