Target
Cholesteryl ester transfer protein
Ligand
BDBM50128137
Substrate
Meas. Tech.
ChEMBL_216899 (CHEMBL815632)
IC50
1200±n/a nM
Citation
 Reinhard, EJWang, JLDurley, RCFobian, YMGrapperhaus, MLHickory, BSMassa, MANorton, MBPromo, MATollefson, MBVernier, WFConnolly, DTWitherbee, BJMelton, MARegina, KJSmith, MESikorski, JA Discovery of a simple picomolar inhibitor of cholesteryl ester transfer protein. J Med Chem 46:2152-68 (2003)  
Target
Name:
Cholesteryl ester transfer protein
Synonyms:
CETP Cholesteryl ester transfer protein (CETP) | Lipid transfer protein I
Type:
Enzyme
Mol. Mass.:
54751.53
Organism:
Homo sapiens (Human)
Description:
P11597
Residue:
493
  
Inhibitor
Name:
BDBM50128137
Synonyms:
(R)-3-((3-(3-ethylphenoxy)phenyl)(3-(1,1,2,2-tetrafluoroethoxy)benzyl)amino)-1,1,1-trifluoropropan-2-ol CHEMBL446661
Type:
Small organic molecule
Emp. Form.:
C26H24F7NO3
Mol. Mass.:
531.4625
SMILES:
CCc1cccc(Oc2cccc(c2)N(C[C@@H](O)C(F)(F)F)Cc2cccc(OC(F)(F)C(F)F)c2)c1
: