Target
Glutamate receptor 1
Ligand
BDBM50017244
Substrate
Meas. Tech.
ChEMBL_90146 (CHEMBL701244)
EC50
14000±n/a nM
Citation
 Bjerrum, EJKristensen, ASPickering, DSGreenwood, JRNielsen, BLiljefors, TSchousboe, ABräuner-Osborne, HMadsen, U Design, synthesis, and pharmacology of a highly subtype-selective GluR1/2 agonist, (RS)-2-amino-3-(4-chloro-3-hydroxy-5-isoxazolyl)propionic acid (Cl-HIBO). J Med Chem 46:2246-9 (2003)  
Target
Name:
Glutamate receptor 1
Synonyms:
GRIA1_MOUSE Glutamate receptor ionotropic, AMPA Gria1
Type:
PROTEIN
Mol. Mass.:
101574.96
Organism:
Mus musculus
Description:
ChEMBL_90145
Residue:
907
  
Inhibitor
Name:
BDBM50017244
Synonyms:
(R,S)-2-amino-3-(4-bromo-3-hydroxy-5-isoxazolyl)propionic acid CHEMBL73698
Type:
Small organic molecule
Emp. Form.:
C6H7BrN2O4
Mol. Mass.:
251.035
SMILES:
NC(Cc1o[nH]c(=O)c1Br)C(O)=O
: