Target
Glutamate receptor 1
Ligand
BDBM50128264
Substrate
Meas. Tech.
ChEMBL_90149 (CHEMBL701247)
Ki
130±n/a nM
Citation
 Bjerrum, EJKristensen, ASPickering, DSGreenwood, JRNielsen, BLiljefors, TSchousboe, ABräuner-Osborne, HMadsen, U Design, synthesis, and pharmacology of a highly subtype-selective GluR1/2 agonist, (RS)-2-amino-3-(4-chloro-3-hydroxy-5-isoxazolyl)propionic acid (Cl-HIBO). J Med Chem 46:2246-9 (2003)  
Target
Name:
Glutamate receptor 1
Synonyms:
AMPA-selective glutamate receptor 1 GLUR1 GRIA1_HUMAN GluR-A Glutamate AMPA 1 Glutamate receptor AMPA 1/2 Glutamate receptor ionotropic, AMPA 1
Type:
Enzyme Catalytic Domain
Mol. Mass.:
101512.92
Organism:
Homo sapiens (Human)
Description:
Glutamate AMPA 1 GRIA1 HUMAN::P42261
Residue:
906
  
Inhibitor
Name:
BDBM50128264
Synonyms:
(R,S)-2-amino-3-(4-chloro-3-hydroxy-5-isoxazolyl)propionate CHEMBL72366
Type:
Small organic molecule
Emp. Form.:
C6H7ClN2O4
Mol. Mass.:
206.584
SMILES:
NC(Cc1o[nH]c(=O)c1Cl)C(O)=O
: