Target
Proto-oncogene tyrosine-protein kinase Src
Ligand
BDBM50128280
Substrate
Meas. Tech.
ChEBML_202623
IC50
11000±n/a nM
Citation
 Faul, MMGillig, JRJirousek, MRBallas, LMSchotten, TKahl, AMohr, M Acyclic N-(azacycloalkyl)bisindolylmaleimides: isozyme selective inhibitors of PKCbeta. Bioorg Med Chem Lett 13:1857-9 (2003)  
Target
Name:
Proto-oncogene tyrosine-protein kinase Src
Synonyms:
Calmodulin/Proto-oncogene tyrosine-protein kinase Src Proto-oncogene c-Src SRC SRC_HUMAN V-src sarcoma (Schmidt-Ruppin A-2) viral oncogene homolog (avian) p60-Src | pp60c-src
Type:
Protein
Mol. Mass.:
59838.60
Organism:
Homo sapiens (Human)
Description:
P12931
Residue:
536
  
Inhibitor
Name:
BDBM50128280
Synonyms:
3-[1-(1-Ethyl-piperidin-4-yl)-1H-indol-3-yl]-4-(1-methyl-1H-indol-3-yl)-pyrrole-2,5-dione | CHEMBL54382
Type:
Small organic molecule
Emp. Form.:
C28H28N4O2
Mol. Mass.:
452.5475
SMILES:
CCN1CCC(CC1)n1cc(C2=C(C(=O)NC2=O)c2cn(C)c3ccccc23)c2ccccc12
: