Target
Ecdysone receptor
Ligand
BDBM50128303
Substrate
Meas. Tech.
ChEBML_65458
EC50
6610.0±n/a nM
Citation
 Tice, CMHormann, REThompson, CSFriz, JLCavanaugh, CKSaggers, JA Optimization of alpha-acylaminoketone ecdysone agonists for control of gene expression. Bioorg Med Chem Lett 13:1883-6 (2003)  
Target
Name:
Ecdysone receptor
Synonyms:
Type:
PROTEIN
Mol. Mass.:
57629.46
Organism:
Choristoneura fumiferana
Description:
ChEMBL_65458
Residue:
513
  
Inhibitor
Name:
BDBM50128303
Synonyms:
3-Methoxy-N-[1-(2-methoxy-benzoyl)-cyclopentyl]-2-methyl-benzamide | CHEMBL298593
Type:
Small organic molecule
Emp. Form.:
C22H25NO4
Mol. Mass.:
367.4382
SMILES:
COc1cccc(C(=O)NC2(CCCC2)C(=O)c2ccccc2OC)c1C
: