Target
Ecdysone receptor
Ligand
BDBM50128302
Substrate
Meas. Tech.
ChEBML_65458
EC50
1250±n/a nM
Citation
 Tice, CMHormann, REThompson, CSFriz, JLCavanaugh, CKSaggers, JA Optimization of alpha-acylaminoketone ecdysone agonists for control of gene expression. Bioorg Med Chem Lett 13:1883-6 (2003)  
Target
Name:
Ecdysone receptor
Synonyms:
Type:
PROTEIN
Mol. Mass.:
57629.46
Organism:
Choristoneura fumiferana
Description:
ChEMBL_65458
Residue:
513
  
Inhibitor
Name:
BDBM50128302
Synonyms:
CHEMBL59044 | N-[1-(3,5-Dimethyl-benzoyl)-cyclohexyl]-2-ethyl-3-methoxy-benzamide
Type:
Small organic molecule
Emp. Form.:
C25H31NO3
Mol. Mass.:
393.5185
SMILES:
CCc1c(OC)cccc1C(=O)NC1(CCCCC1)C(=O)c1cc(C)cc(C)c1
: