Target
Ecdysone receptor
Ligand
BDBM50128313
Substrate
Meas. Tech.
ChEBML_65458
EC50
1910±n/a nM
Citation
 Tice, CMHormann, REThompson, CSFriz, JLCavanaugh, CKSaggers, JA Optimization of alpha-acylaminoketone ecdysone agonists for control of gene expression. Bioorg Med Chem Lett 13:1883-6 (2003)  
Target
Name:
Ecdysone receptor
Synonyms:
Type:
PROTEIN
Mol. Mass.:
57629.46
Organism:
Choristoneura fumiferana
Description:
ChEMBL_65458
Residue:
513
  
Inhibitor
Name:
BDBM50128313
Synonyms:
CHEMBL57543 | N-[1-(3,5-Dimethyl-benzoyl)-cyclopentyl]-3-methoxy-2-methyl-benzamide
Type:
Small organic molecule
Emp. Form.:
C23H27NO3
Mol. Mass.:
365.4654
SMILES:
COc1cccc(C(=O)NC2(CCCC2)C(=O)c2cc(C)cc(C)c2)c1C
: