Target
Sodium-dependent serotonin transporter
Ligand
BDBM50128367
Substrate
Meas. Tech.
ChEBML_201966
Ki
2±n/a nM
Citation
 Takeuchi, KKohn, TJHonigschmidt, NARocco, VPSpinazze, PGKoch, DJNelson, DLWainscott, DBAhmad, LJShaw, JThrelkeld, PGWong, DT Advances toward new antidepressants beyond SSRIs: 1-aryloxy-3-piperidinylpropan-2-ols with dual 5-HT1A receptor antagonism/SSRI activities. Part 1. Bioorg Med Chem Lett 13:1903-5 (2003)  
Target
Name:
Sodium-dependent serotonin transporter
Synonyms:
5-HT Transporter 5HT transporter Anandamid membrane transporter, AMT Monoamine transporters; Norepinephrine & serotonin Slc6a4 Sodium-dependent serotonin transporter (SERT) | imipramine receptor
Type:
Multi-pass membrane protein
Mol. Mass.:
70168.43
Organism:
Rattus norvegicus (rat)
Description:
P31652
Residue:
630
  
Inhibitor
Name:
BDBM50128367
Synonyms:
(S)-1-(1H-indol-4-yloxy)-3-(4-(6-fluorobenzo[b]thiophen-2-yl)piperidin-1-yl)propan-2-ol CHEMBL56601
Type:
Small organic molecule
Emp. Form.:
C24H25FN2O2S
Mol. Mass.:
424.531
SMILES:
O[C@H](COc1cccc2[nH]ccc12)CN1CCC(CC1)c1cc2ccc(F)cc2s1
: