Target
5-hydroxytryptamine receptor 1A
Ligand
BDBM50128379
Substrate
Meas. Tech.
ChEBML_921
Ki
23±n/a nM
Citation
 Takeuchi, KKohn, TJHonigschmidt, NARocco, VPSpinazze, PGKoch, DJNelson, DLWainscott, DBAhmad, LJShaw, JThrelkeld, PGWong, DT Advances toward new antidepressants beyond SSRIs: 1-aryloxy-3-piperidinylpropan-2-ols with dual 5-HT1A receptor antagonism/SSRI activities. Part 1. Bioorg Med Chem Lett 13:1903-5 (2003)  
Target
Name:
5-hydroxytryptamine receptor 1A
Synonyms:
5-HT-1A 5-hydroxytryptamine receptor 1A (5-HT-1A) ADRB2RL1 Dopamine D2 receptor and serotonin 1a receptor HTR1A | Serotonin receptor 1A
Type:
Mol. Mass.:
46122.49
Organism:
Homo sapiens (Human)
Description:
Residue:
422
  
Inhibitor
Name:
BDBM50128379
Synonyms:
(S)-1-[4-(6-Methyl-benzo[b]thiophen-2-yl)-piperidin-1-yl]-3-(2-methyl-1H-indol-4-yloxy)-propan-2-ol | CHEMBL56191
Type:
Small organic molecule
Emp. Form.:
C26H30N2O2S
Mol. Mass.:
434.594
SMILES:
Cc1cc2c(OC[C@@H](O)CN3CCC(CC3)c3cc4ccc(C)cc4s3)cccc2[nH]1
: