Target
Insulin-like growth factor-binding protein 3
Ligand
BDBM50128443
Substrate
Meas. Tech.
ChEBML_90404
Ki
32±n/a nM
Citation
 Zhu, YFWilcoxen, KGross, TConnors, PStrack, NGross, RHuang, CQMcCarthy, JRXie, QLing, NChen, C 6,7-dihydroxyisoquinoline-3-carboxylic acids are potent inhibitors on the binding of insulin-like growth factor (IGF) to IGF-binding proteins: optimization of the 1-position benzoyl side chain. Bioorg Med Chem Lett 13:1927-30 (2003)  
Target
Name:
Insulin-like growth factor-binding protein 3
Synonyms:
IBP3 IGFBP3 | Insulin-like growth factor binding protein 3
Type:
PROTEIN
Mol. Mass.:
31690.53
Organism:
Homo sapiens (Human)
Description:
ChEMBL_90404
Residue:
291
  
Inhibitor
Name:
BDBM50128443
Synonyms:
6,7-Dihydroxy-1-[hydroxy-(4-phenoxy-phenyl)-methyl]-isoquinoline-3-carboxylic acid | CHEMBL291454
Type:
Small organic molecule
Emp. Form.:
C23H17NO6
Mol. Mass.:
403.3842
SMILES:
OC(c1ccc(Oc2ccccc2)cc1)c1nc(cc2cc(O)c(O)cc12)C(O)=O
: