Target
Geranylgeranyl transferase type-1 subunit beta/Protein farnesyltransferase/geranylgeranyltransferase type-1 subunit alpha
Ligand
BDBM50128465
Substrate
Meas. Tech.
ChEMBL_71805 (CHEMBL683489)
IC50
5±n/a nM
Citation
 Murthi, KKSmith, SEKluge, AFBergnes, GBureau, PBerlin, V Antifungal activity of a Candida albicans GGTase I inhibitor-alanine conjugate. Inhibition of Rho1p prenylation in C. albicans. Bioorg Med Chem Lett 13:1935-7 (2003)  
Target
Name:
Geranylgeranyl transferase type-1 subunit beta/Protein farnesyltransferase/geranylgeranyltransferase type-1 subunit alpha
Synonyms:
Geranylgeranyl transferase type I Geranylgeranyl transferase type I beta/Protein farnesyltransferase/geranylgeranyltransferase type I alpha subunit
Type:
Mol. Mass.:
Description:
ASSAY_ID of EBI is 70196
Components:
This complex has 2 components.
Component 1
Name:
Protein farnesyltransferase/geranylgeranyltransferase type-1 subunit alpha
Synonyms:
CAAX farnesyltransferase alpha subunit FNTA_HUMAN FTase-alpha Geranylgeranyl Transferase (GGTase-I) Chain A Protein Farnesyltransferase (PFT) Chain A Protein farnesyltransferase Protein farnesyltransferase/geranylgeranyltransferase type I alpha subunit | Ras proteins prenyltransferase alpha
Type:
Enzyme
Mol. Mass.:
44392.46
Organism:
Homo sapiens (Human)
Description:
Recombinant human FTase.
Residue:
379
  
Component 2
Name:
Geranylgeranyl transferase type-1 subunit beta
Synonyms:
2.5.1.59 Geranylgeranyl transferase type I Geranylgeranyl transferase type I subunit beta PGGT1B Protein farnesyl/geranylgeranyl transferase | Type I protein geranyl-geranyltransferase subunit beta
Type:
Mol. Mass.:
42369.84
Organism:
Homo sapiens (Human)
Description:
Residue:
377
  
Inhibitor
Name:
BDBM50128465
Synonyms:
(S)-2-{[1-((R)-2-Amino-3-mercapto-propionyl)-4-phenyl-piperidine-4-carbonyl]-amino}-4-methyl-pentanoic acid methyl ester | CHEMBL60804
Type:
Small organic molecule
Emp. Form.:
C22H33N3O4S
Mol. Mass.:
435.58
SMILES:
COC(=O)[C@H](CC(C)C)NC(=O)C1(CCN(CC1)C(=O)[C@@H](N)CS)c1ccccc1
: