Target
Protein farnesyltransferase subunit beta/geranylgeranyltransferase type-1 subunit alpha
Ligand
BDBM50128791
Substrate
Meas. Tech.
ChEMBL_70274 (CHEMBL681413)
IC50
>1200±n/a nM
Citation
 Nara, STanaka, REishima, JHara, MTakahashi, YOtaki, SFoglesong, RJHughes, PFTurkington, SKanda, Y Discovery and structure-activity relationships of novel piperidine inhibitors of farnesyltransferase. J Med Chem 46:2467-73 (2003)  
Target
Name:
Protein farnesyltransferase subunit beta/geranylgeranyltransferase type-1 subunit alpha
Synonyms:
Protein Farnesyltransferase (PFT) | Protein farnesyltransferase
Type:
Protein Complex
Mol. Mass.:
Description:
Purified bovine brain FTase.
Components:
This complex has 2 components.
Component 1
Name:
Protein farnesyltransferase/geranylgeranyltransferase type-1 subunit alpha
Synonyms:
CAAX farnesyltransferase alpha subunit FNTA_BOVIN GGTase-I-alpha Protein Farnesyltransferase (PFT) Chain A Protein farnesyltransferase/geranylgeranyltransferase type I alpha subunit Type I protein geranyl-geranyltransferase alpha subunit
Type:
Enzyme
Mol. Mass.:
43827.38
Organism:
Bos taurus (bovine)
Description:
The enzyme was purified from a bovine brain homogenate by sequential ammonium sulfate fractionation and affinity chromatography.
Residue:
375
  
Component 2
Name:
Protein farnesyltransferase subunit beta
Synonyms:
CAAX farnesyltransferase subunit beta FNTB_BOVIN Protein farnesyltransferase Protein farnesyltransferase subunit beta Ras proteins prenyltransferase subunit beta
Type:
Enzyme Subunit
Mol. Mass.:
48758.49
Organism:
Bos taurus (bovine)
Description:
Protein farnesyltransferase subunit beta
Residue:
437
  
Inhibitor
Name:
BDBM50128791
Synonyms:
4-(2-Bromo-phenyl)-6-(4-hydroxy-3-hydroxymethyl-phenyl)-5-nitro-1-pyridin-3-ylmethyl-piperidin-2-one | CHEMBL81061
Type:
Small organic molecule
Emp. Form.:
C24H22BrN3O5
Mol. Mass.:
512.353
SMILES:
OCc1cc(ccc1O)[C@@H]1[C@H](C(CC(=O)N1Cc1cccnc1)c1ccccc1Br)[N+]([O-])=O
: