Target
Sodium channel protein type 4 subunit alpha
Ligand
BDBM50044140
Substrate
Meas. Tech.
ChEMBL_143970 (CHEMBL752561)
IC50
800000±n/a nM
Citation
 Choudhury-Mukherjee, ISchenck, HACechova, SPajewski, TNKapur, JEllena, JCafiso, DSBrown, ML Design, synthesis, and evaluation of analogues of 3,3,3-trifluoro-2-hydroxy-2-phenyl-propionamide as orally available general anesthetics. J Med Chem 46:2494-501 (2003)  
Target
Name:
Sodium channel protein type 4 subunit alpha
Synonyms:
SCN4A SkM1 Sodium channel protein skeletal muscle subunit alpha Sodium channel protein type IV alpha subunit Voltage-gated sodium channel subunit alpha Nav1.4 | Voltage-gated sodium channel subunit alpha Nav1.4 (Nav1.4)
Type:
Protein
Mol. Mass.:
208010.01
Organism:
Homo sapiens (Human)
Description:
P35499
Residue:
1836
  
Inhibitor
Name:
BDBM50044140
Synonyms:
2-(2-Chloro-phenyl)-2-methylamino-cyclohexanone CHEMBL742 Ketalar
Type:
Small organic molecule
Emp. Form.:
C13H16ClNO
Mol. Mass.:
237.725
SMILES:
CNC1(CCCCC1=O)c1ccccc1Cl
: