Target
Histamine H3 receptor
Ligand
BDBM50220981
Substrate
Meas. Tech.
ChEMBL_83801 (CHEMBL692577)
Ki
724±n/a nM
Citation
 Turner, SCEsbenshade, TABennani, YLHancock, AA A new class of histamine H(3)-receptor antagonists: synthesis and structure-activity relationships of 7,8,9,10-tetrahydro-6H-cyclohepta[b]quinolines. Bioorg Med Chem Lett 13:2131-5 (2003)  
Target
Name:
Histamine H3 receptor
Synonyms:
G-protein coupled receptor 97 HH3R HRH3 Histamine H3 receptor (H3) Histamine receptor (H3 and H4)
Type:
G Protein-Coupled Receptor (GPCR)
Mol. Mass.:
48691.47
Organism:
Homo sapiens (Human)
Description:
Binding assays were using CHO cells stably expressing hH3R receptors.
Residue:
445
  
Inhibitor
Name:
BDBM50220981
Synonyms:
CHEMBL65797
Type:
Small organic molecule
Emp. Form.:
C23H29N3
Mol. Mass.:
347.4965
SMILES:
CN1CCN(CCC#Cc2c3CCCCCc3nc3ccccc23)CC1
: