Target
72 kDa type IV collagenase
Ligand
BDBM50084289
Substrate
Meas. Tech.
ChEBML_104384
IC50
3±n/a nM
Citation
 Fei, XZheng, QHLiu, XWang, JQSun, HBMock, BHStone, KLMiller, KDSledge, GWHutchins, GD Synthesis of radiolabeled biphenylsulfonamide matrix metalloproteinase inhibitors as new potential PET cancer imaging agents. Bioorg Med Chem Lett 13:2217-22 (2003)  
Target
Name:
72 kDa type IV collagenase
Synonyms:
72 kDa gelatinase CLG4A Gelatinase A (MMP-2) MMP2_HUMAN Matrix metalloproteinase-2 (MMP 2) Matrix metalloproteinases 2 (MMP-2) | TBE-1
Type:
Enzyme
Mol. Mass.:
73870.36
Organism:
Homo sapiens (Human)
Description:
P08253
Residue:
660
  
Inhibitor
Name:
BDBM50084289
Synonyms:
(S)-2-(4'-methoxy-biphenyl-4-sulfonylamino)-3-methyl-butyric acid CHEMBL44383
Type:
Small organic molecule
Emp. Form.:
C18H21NO5S
Mol. Mass.:
363.428
SMILES:
COc1ccc(cc1)-c1ccc(cc1)S(=O)(=O)N[C@@H](C(C)C)C(O)=O
: