Target
Methionine--tRNA ligase, cytoplasmic
Ligand
BDBM50129548
Substrate
Meas. Tech.
ChEMBL_105286 (CHEMBL718953)
IC50
42500±n/a nM
Citation
 Finn, JMattia, KMorytko, MRam, SYang, YWu, XMak, EGallant, PKeith, D Discovery of a potent and selective series of pyrazole bacterial methionyl-tRNA synthetase inhibitors. Bioorg Med Chem Lett 13:2231-4 (2003)  
Target
Name:
Methionine--tRNA ligase, cytoplasmic
Synonyms:
MARS Methionyl-tRNA synthetase | SYMC_HUMAN
Type:
PROTEIN
Mol. Mass.:
101110.04
Organism:
Homo sapiens (Human)
Description:
ChEMBL_105283
Residue:
900
  
Inhibitor
Name:
BDBM50129548
Synonyms:
5-(2',4'-Dichloro-biphenyl-4-yl)-1-pyridin-2-ylmethyl-1H-pyrazole-3-carboxylic acid | CHEMBL70475
Type:
Small organic molecule
Emp. Form.:
C22H15Cl2N3O2
Mol. Mass.:
424.279
SMILES:
OC(=O)c1cc(-c2ccc(cc2)-c2ccc(Cl)cc2Cl)n(Cc2ccccn2)n1
: