Target
Methionine--tRNA ligase, cytoplasmic
Ligand
BDBM50129529
Substrate
Meas. Tech.
ChEMBL_203520 (CHEMBL806984)
IC50
2950±n/a nM
Citation
 Finn, JMattia, KMorytko, MRam, SYang, YWu, XMak, EGallant, PKeith, D Discovery of a potent and selective series of pyrazole bacterial methionyl-tRNA synthetase inhibitors. Bioorg Med Chem Lett 13:2231-4 (2003)  
Target
Name:
Methionine--tRNA ligase, cytoplasmic
Synonyms:
MARS Methionyl-tRNA synthetase | SYMC_HUMAN
Type:
PROTEIN
Mol. Mass.:
101110.04
Organism:
Homo sapiens (Human)
Description:
ChEMBL_105283
Residue:
900
  
Inhibitor
Name:
BDBM50129529
Synonyms:
5-(2',4'-Dichloro-biphenyl-4-yl)-1-pyridin-2-yl-1H-pyrazole-3-carboxylic acid amide | CHEMBL72460
Type:
Small organic molecule
Emp. Form.:
C21H14Cl2N4O
Mol. Mass.:
409.268
SMILES:
NC(=O)c1cc(-c2ccc(cc2)-c2ccc(Cl)cc2Cl)n(n1)-c1ccccn1
: