Target
M-phase inducer phosphatase 3
Ligand
BDBM50129575
Substrate
Meas. Tech.
ChEMBL_49190 (CHEMBL662118)
IC50
30000±n/a nM
Citation
 Sohn, JKiburz, BLi, ZDeng, LSafi, APirrung, MCRudolph, J Inhibition of Cdc25 phosphatases by indolyldihydroxyquinones. J Med Chem 46:2580-8 (2003)  
Target
Name:
M-phase inducer phosphatase 3
Synonyms:
CDC25C M-phase inducer phosphatase 3 | MPIP3_HUMAN
Type:
Substrate
Mol. Mass.:
53366.11
Organism:
Homo sapiens (Human)
Description:
P30307
Residue:
473
  
Inhibitor
Name:
BDBM50129575
Synonyms:
2,5-Dihydroxy-3-(1H-indol-3-yl)-[1,4]benzoquinone | CHEMBL312892
Type:
Small organic molecule
Emp. Form.:
C14H9NO4
Mol. Mass.:
255.2256
SMILES:
O=C1CC(=O)C(=O)C(c2c[nH]c3ccccc23)C1=O
: