Target
M-phase inducer phosphatase 1
Ligand
BDBM50129585
Substrate
Meas. Tech.
ChEMBL_49005 (CHEMBL662886)
IC50
2300±n/a nM
Citation
 Sohn, JKiburz, BLi, ZDeng, LSafi, APirrung, MCRudolph, J Inhibition of Cdc25 phosphatases by indolyldihydroxyquinones. J Med Chem 46:2580-8 (2003)  
Target
Name:
M-phase inducer phosphatase 1
Synonyms:
CDC25A Dual specificity phosphatase Cdc25A MPIP1_HUMAN | phosphatase Cdc25
Type:
Protein
Mol. Mass.:
59090.18
Organism:
Homo sapiens (Human)
Description:
P30304
Residue:
524
  
Inhibitor
Name:
BDBM50129585
Synonyms:
3-(7-Benzyl-1H-indol-3-yl)-2,5-dihydroxy-[1,4]benzoquinone | CHEMBL88038
Type:
Small organic molecule
Emp. Form.:
C21H15NO4
Mol. Mass.:
345.3481
SMILES:
O=C1CC(=O)C(=O)C(c2c[nH]c3c(Cc4ccccc4)cccc23)C1=O
: