Target
M-phase inducer phosphatase 3
Ligand
BDBM50129583
Substrate
Meas. Tech.
ChEMBL_49190 (CHEMBL662118)
IC50
10000±n/a nM
Citation
 Sohn, JKiburz, BLi, ZDeng, LSafi, APirrung, MCRudolph, J Inhibition of Cdc25 phosphatases by indolyldihydroxyquinones. J Med Chem 46:2580-8 (2003)  
Target
Name:
M-phase inducer phosphatase 3
Synonyms:
CDC25C M-phase inducer phosphatase 3 | MPIP3_HUMAN
Type:
Substrate
Mol. Mass.:
53366.11
Organism:
Homo sapiens (Human)
Description:
P30307
Residue:
473
  
Inhibitor
Name:
BDBM50129583
Synonyms:
3-[7-(3,7-Dimethyl-octa-2,6-dienyl)-1H-indol-3-yl]-2,5-dihydroxy-[1,4]benzoquinone | CHEMBL87872
Type:
Small organic molecule
Emp. Form.:
C24H25NO4
Mol. Mass.:
391.4596
SMILES:
CC(C)=CCC\C(C)=C\Cc1cccc2c(c[nH]c12)C1C(=O)C(=O)CC(=O)C1=O
: