Target
Bone morphogenetic protein 1
Ligand
BDBM50130133
Substrate
Meas. Tech.
ChEBML_158896
Ki
950±n/a nM
Citation
 Robinson, LAWilson, DMDelaet, NGBradley, EKDankwardt, SMCampbell, JAMartin, RLVan Wart, HEWalker, KASullivan, RW Novel inhibitors of procollagen C-proteinase. Part 2: glutamic acid hydroxamates. Bioorg Med Chem Lett 13:2381-4 (2003)  
Target
Name:
Bone morphogenetic protein 1
Synonyms:
BMP-1 BMP1_HUMAN PCOLC Procollagen C-proteinase | mTld
Type:
PROTEIN
Mol. Mass.:
111254.03
Organism:
Homo sapiens (Human)
Description:
ChEMBL_518962
Residue:
986
  
Inhibitor
Name:
BDBM50130133
Synonyms:
3-[Benzo[1,3]dioxol-5-ylmethyl-(4-methoxy-benzenesulfonyl)-amino]-N-hydroxy-succinamic acid methyl ester | CHEMBL311313
Type:
Small organic molecule
Emp. Form.:
C20H22N2O9S
Mol. Mass.:
466.462
SMILES:
COC(=O)C[C@@H](N(Cc1ccc2OCOc2c1)S(=O)(=O)c1ccc(OC)cc1)C(=O)NO
: