Target
5-hydroxytryptamine receptor 1A
Ligand
BDBM50130170
Substrate
Meas. Tech.
ChEMBL_892 (CHEMBL835002)
Ki
19±n/a nM
Citation
 Takeuchi, KKohn, TJHonigschmidt, NARocco, VPSpinazze, PGKoch, DJAtkinson, STHertel, LWNelson, DLWainscott, DBAhmad, LJShaw, JThrelkeld, PGWong, DT Advances Toward new antidepressants beyond SSRIs: 1-aryloxy-3-piperidinylpropan-2-ols with dual 5-HT(1A) receptor antagonism/SSRI activities. Part 2. Bioorg Med Chem Lett 13:2393-7 (2003)  
Target
Name:
5-hydroxytryptamine receptor 1A
Synonyms:
5-HT-1A 5-hydroxytryptamine receptor 1A (5-HT-1A) ADRB2RL1 Dopamine D2 receptor and serotonin 1a receptor HTR1A | Serotonin receptor 1A
Type:
Mol. Mass.:
46122.49
Organism:
Homo sapiens (Human)
Description:
Residue:
422
  
Inhibitor
Name:
BDBM50130170
Synonyms:
(S)-1-(1H-Indol-4-yloxy)-3-[(1R,3S,5S)-3-(4-methoxy-benzo[b]thiophen-2-yl)-8-aza-bicyclo[3.2.1]oct-8-yl]-propan-2-ol (exo)-1-(1H-Indol-4-yloxy)-3-[3-(4-methoxy-benzo[b]thiophen-2-yl)-8-aza-bicyclo[3.2.1]oct-8-yl]-propan-2-ol | CHEMBL421328
Type:
Small organic molecule
Emp. Form.:
C27H30N2O3S
Mol. Mass.:
462.604
SMILES:
COc1cccc2sc(cc12)[C@H]1C[C@@H]2CC[C@H](C1)N2C[C@H](O)COc1cccc2[nH]ccc12
: