Target
cAMP-dependent protein kinase catalytic subunit alpha/beta/gamma
Ligand
BDBM50130225
Substrate
Meas. Tech.
ChEMBL_161889 (CHEMBL772598)
IC50
>25000±n/a nM
Citation
 Castro, ACDang, LCSoucy, FGrenier, LMazdiyasni, HHottelet, MParent, LPien, CPalombella, VAdams, J Novel IKK inhibitors: beta-carbolines. Bioorg Med Chem Lett 13:2419-22 (2003)  
Target
Name:
cAMP-dependent protein kinase catalytic subunit alpha/beta/gamma
Synonyms:
cAMP-dependent protein kinase (PKA)
Type:
Mol. Mass.:
Description:
ASSAY_ID of ChEMBL is 217489
Components:
This complex has 3 components.
Component 1
Name:
cAMP-dependent protein kinase catalytic subunit beta
Synonyms:
KAPCB_HUMAN PKAC-beta cAMP-dependent protein kinase (PKA) cAMP-dependent protein kinase catalytic subunit beta
Type:
PROTEIN
Mol. Mass.:
40631.25
Organism:
Homo sapiens (Human)
Description:
ChEMBL_586348
Residue:
351
  
Component 2
Name:
cAMP-dependent protein kinase catalytic subunit alpha
Synonyms:
KAPCA_HUMAN PKACA cAMP-dependent protein kinase (PKA) cAMP-dependent protein kinase catalytic subunit alpha cAMP-dependent protein kinase catalytic subunit alpha (PKACA) cAMP-dependent protein kinase catalytic subunit alpha isoform 1 | cAMP-dependent protein kinase, alpha-catalytic subunit
Type:
Enzyme Catalytic Subunit
Mol. Mass.:
40598.73
Organism:
Homo sapiens (Human)
Description:
Residue:
351
  
Component 3
Name:
cAMP-dependent protein kinase catalytic subunit gamma
Synonyms:
KAPCG_HUMAN PRKACG cAMP-dependent protein kinase catalytic subunit gamma
Type:
PROTEIN
Mol. Mass.:
40442.03
Organism:
Homo sapiens (Human)
Description:
ChEMBL_104720
Residue:
351
  
Inhibitor
Name:
BDBM50130225
Synonyms:
CHEMBL310179 | N-(6-Chloro-9H-beta-carbolin-8-yl)-3-methoxy-benzamide
Type:
Small organic molecule
Emp. Form.:
C19H14ClN3O2
Mol. Mass.:
351.786
SMILES:
COc1cccc(c1)C(=O)Nc1cc(Cl)cc2c3cc[nH]cc3nc12
: