Target
Transient receptor potential cation channel subfamily V member 1
Ligand
BDBM50196343
Substrate
Meas. Tech.
ChEMBL_215642 (CHEMBL820959)
EC50
2.83±n/a nM
Citation
 Lee, JLee, JKang, MShin, MKim, JMKang, SULim, JOChoi, HKSuh, YGPark, HGOh, UKim, HDPark, YHHa, HJKim, YHToth, AWang, YTran, RPearce, LVLundberg, DJBlumberg, PM N-(3-acyloxy-2-benzylpropyl)-N'-[4-(methylsulfonylamino)benzyl]thiourea analogues: novel potent and high affinity antagonists and partial antagonists of the vanilloid receptor. J Med Chem 46:3116-26 (2003)  
Target
Name:
Transient receptor potential cation channel subfamily V member 1
Synonyms:
Capsaicin receptor TRPV1_RAT Trpv1 Vanilloid VR1 Vanilloid receptor 1 (VRI/TRPV1) Vanilloid receptor type 1-like (TrpV1/Vr1) Vr1l | osm-9-like TRP channel 1
Type:
Transient Receptor
Mol. Mass.:
94956.12
Organism:
Rattus norvegicus (rat)
Description:
O35433
Residue:
838
  
Inhibitor
Name:
BDBM50196343
Synonyms:
2,2-Dimethyl-propionic acid 2-(4-tert-butyl-benzyl)-3-[3-(4-hydroxy-3-methoxy-benzyl)-thioureido]-propyl ester CHEMBL392584
Type:
Small organic molecule
Emp. Form.:
C28H40N2O4S
Mol. Mass.:
500.693
SMILES:
COc1cc(CNC(=S)NCC(COC(=O)C(C)(C)C)Cc2ccc(cc2)C(C)(C)C)ccc1O
: