Target
Peptide deformylase, mitochondrial
Ligand
BDBM50131301
Substrate
Meas. Tech.
ChEBML_154178
IC50
20±n/a nM
Citation
 Davies, SJAyscough, APBeckett, RPBragg, RAClements, JMDoel, SGrew, CLaunchbury, SBPerkins, GMPratt, LMSmith, HKSpavold, ZMThomas, SWTodd, RSWhittaker, M Structure-activity relationships of the peptide deformylase inhibitor BB-3497: modification of the methylene spacer and the P1' side chain. Bioorg Med Chem Lett 13:2709-13 (2003)  
Target
Name:
Peptide deformylase, mitochondrial
Synonyms:
DEFM_HUMAN PDF1A Peptide deformylase, mitochondrial | Polypeptide deformylase
Type:
PROTEIN
Mol. Mass.:
27023.25
Organism:
Homo sapiens (Human)
Description:
ChEMBL_154318
Residue:
243
  
Inhibitor
Name:
BDBM50131301
Synonyms:
(S)-2-[(R)-2-Benzyl-3-(formyl-hydroxy-amino)-propionylamino]-3,3,N,N-tetramethyl-butyramide | CHEMBL328688
Type:
Small organic molecule
Emp. Form.:
C19H29N3O4
Mol. Mass.:
363.4513
SMILES:
CN(C)C(=O)[C@@H](NC(=O)[C@@H](CN(O)C=O)Cc1ccccc1)C(C)(C)C
: