Target
Disintegrin and metalloproteinase domain-containing protein 17
Ligand
BDBM50131384
Substrate
Meas. Tech.
ChEBML_207327
Ki
510±n/a nM
Citation
 Moriyama, HTsukida, TInoue, YKondo, HYoshino, KNishimura, S Structure--activity relationships of azasugar-based MMP/ADAM inhibitors. Bioorg Med Chem Lett 13:2737-40 (2003)  
Target
Name:
Disintegrin and metalloproteinase domain-containing protein 17
Synonyms:
ADA17_HUMAN CSVP Disintegrin and metalloproteinase domain-containing protein 17 (ADAM17) TNF-alpha convertase TNF-alpha-converting enzyme (TACE) Tumor necrosis factor-α converting enzyme (TACE)
Type:
Enzyme
Mol. Mass.:
93007.89
Organism:
Homo sapiens (Human)
Description:
Residue:
824
  
Inhibitor
Name:
BDBM50131384
Synonyms:
(2R,3S,4S,5S)-3,4,5-Trihydroxy-1-(4-methoxy-benzenesulfonyl)-piperidine-2-carboxylic acid hydroxyamide | CHEMBL93720
Type:
Small organic molecule
Emp. Form.:
C13H18N2O8S
Mol. Mass.:
362.356
SMILES:
COc1ccc(cc1)S(=O)(=O)N1C[C@H](O)[C@H](O)[C@@H](O)[C@@H]1C(=O)NO
: