Target
Tyrosine-protein phosphatase non-receptor type 1
Ligand
BDBM50131549
Substrate
Meas. Tech.
ChEMBL_162274 (CHEMBL770822)
Kd
910000.0±n/a nM
Citation
 Liu, GXin, ZLiang, HAbad-Zapatero, CHajduk, PJJanowick, DASzczepankiewicz, BGPei, ZHutchins, CWBallaron, SJStashko, MALubben, THBerg, CERondinone, CMTrevillyan, JMJirousek, MR Selective protein tyrosine phosphatase 1B inhibitors: targeting the second phosphotyrosine binding site with non-carboxylic acid-containing ligands. J Med Chem 46:3437-40 (2003)  
Target
Name:
Tyrosine-protein phosphatase non-receptor type 1
Synonyms:
PTN1_HUMAN PTPN1 Protein tyrosine phosphatase-1B (PTP1B) Protein-tyrosine phosphatase 1B (PTP1B) Tyrosine-protein phosphatase non-receptor type 1 (PTP1B)
Type:
Protein phosphatase
Mol. Mass.:
49963.76
Organism:
Homo sapiens (Human)
Description:
Human recombinant GST-fusion PTP1B (1-435).
Residue:
435
  
Inhibitor
Name:
BDBM50131549
Synonyms:
4-Amino-3-bromo-5-cyano-2-hydroxy-benzoic acid | CHEMBL117270
Type:
Small organic molecule
Emp. Form.:
C8H5BrN2O3
Mol. Mass.:
257.041
SMILES:
Nc1c(Br)c(O)c(cc1C#N)C(O)=O
: